New build process- frameworks archive no longer required

Discuss the current and future development of Max.
Post Reply
User avatar
sbooth
Site Admin
Posts: 2450
Joined: Fri Dec 23, 2005 7:45 am
Location: USA
Contact:

New build process- frameworks archive no longer required

Post by sbooth » Tue Sep 26, 2006 11:35 pm

I've checked in the frameworks Max uses to svn, as suggested by krmathis. Updated build instructions are on http://sbooth.org/Max/.

I've already received one report of an error building Growl.framework- any reports of successes or failures with the new build system would be appreciated.

User avatar
krmathis
Posts: 233
Joined: Thu Feb 02, 2006 11:05 am
Location: Oslo, Norway

Post by krmathis » Wed Sep 27, 2006 4:48 am

Here are my result building revision 934:
=== BUILDING NATIVE TARGET FLAC.framework WITH CONFIGURATION Release ===

Checking Dependencies...

CompileC build/flac.build/Release/FLAC.framework.build/Objects-normal/ppc/format.o /Users/krmathis/Development/Max/trunk/Frameworks/flac/flac/src/libFLAC/format.c normal ppc c com.apple.compilers.gcc.4_0
cd /Users/krmathis/Development/Max/trunk/Frameworks/flac
/usr/bin/gcc-4.0 -x c -arch ppc -pipe -Wno-trigraphs -fpascal-strings -fasm-blocks -Os -Wreturn-type -Wunused-variable -D__MACOSX__ -fmessage-length=0 -mtune=G5 -mmacosx-version-min=10.4 -I/Users/krmathis/Development/Max/trunk/Frameworks/flac/build/flac.build/Release/FLAC.framework.build/FLAC.hmap -F/Users/krmathis/Development/Max/trunk/Frameworks/flac/build/Release -I/Users/krmathis/Development/Max/trunk/Frameworks/flac -I/Users/krmathis/Development/Max/trunk/Frameworks/flac/flac/include -I/Users/krmathis/Development/Max/trunk/Frameworks/flac/flac/src/libFLAC/include -I/Users/krmathis/Development/Max/trunk/Frameworks/flac/build/Release/include -I/Users/krmathis/Development/Max/trunk/Frameworks/flac/build/flac.build/Release/FLAC.framework.build/DerivedSources -isysroot /Developer/SDKs/MacOSX10.4u.sdk -include /Library/Caches/com.apple.Xcode.501/SharedPrecompiledHeaders/flac_Prefix-engmicemzmvqqddzmsxzejjjcwlj/flac_Prefix.pch -c /Users/krmathis/Development/Max/trunk/Frameworks/flac/flac/src/libFLAC/format.c -o /Users/krmathis/Development/Max/trunk/Frameworks/flac/build/flac.build/Release/FLAC.framework.build/Objects-normal/ppc/format.o
/Users/krmathis/Development/Max/trunk/Frameworks/flac/flac/src/libFLAC/format.c:41:24: error: config_osx.h: No such file or directory
/Users/krmathis/Development/Max/trunk/Frameworks/flac/flac/src/libFLAC/format.c:57: error: 'VERSION' undeclared here (not in a function)
/Users/krmathis/Development/Max/trunk/Frameworks/flac/flac/src/libFLAC/format.c:63: error: parse error before 'VERSION'
** BUILD FAILED **
xcodebuild: Error: the project flac.xcodeproj does not exist in this directory.
./build-frameworks.sh: line 99: cd: taglib: No such file or directory
./build-frameworks.sh: line 107: cd: mac: No such file or directory
./build-frameworks.sh: line 115: cd: sndfile: No such file or directory
./build-frameworks.sh: line 123: cd: mpcdec: No such file or directory
./build-frameworks.sh: line 131: cd: cuetools: No such file or directory
./build-frameworks.sh: line 139: cd: cdparanoia: No such file or directory
./build-frameworks.sh: line 147: cd: mp4v2: No such file or directory
./build-frameworks.sh: line 155: cd: cddb: No such file or directory

User avatar
sbooth
Site Admin
Posts: 2450
Joined: Fri Dec 23, 2005 7:45 am
Location: USA
Contact:

Post by sbooth » Wed Sep 27, 2006 5:02 am

OK, I forgot to check in config_osx.h- it's there now.

Maurits
Posts: 117
Joined: Sun Jan 29, 2006 1:36 pm
Location: London, Europe

Post by Maurits » Wed Sep 27, 2006 9:01 am

Is LAME 3.97 final in the frameworks now?

User avatar
krmathis
Posts: 233
Joined: Thu Feb 02, 2006 11:05 am
Location: Oslo, Norway

Post by krmathis » Wed Sep 27, 2006 2:38 pm

sbooth wrote:OK, I forgot to check in config_osx.h- it's there now.
Revision 940 compiled a lot further, but not until the end! ;)
/usr/bin/g++-4.0 -o /Users/krmathis/Development/Max/trunk/build/Max.build/Release/Max.build/Objects-normal/ppc/Max -L/Users/krmathis/Development/Max/trunk/build/Release -L/Users/krmathis/Development/Max/trunk -F/Users/krmathis/Development/Max/trunk/build/Release -F/Users/krmathis/Development/Max/trunk -F/Users/krmathis/Development/Max/trunk/Frameworks -F/Users/krmathis/Development/Max/trunk/Frameworks/Sparkle/build/Release -F/Users/krmathis/Development/Max/trunk/Frameworks/Growl/build/Deployment -F/Users/krmathis/Development/Max/trunk/Frameworks/ogg/build/Release -F/Users/krmathis/Development/Max/trunk/Frameworks/vorbis/build/Release -F/Users/krmathis/Development/Max/trunk/Frameworks/lame/build/Release -F/Users/krmathis/Development/Max/trunk/Frameworks/wavpack/build/Release -F/Users/krmathis/Development/Max/trunk/Frameworks/speex/build/Release -F/Users/krmathis/Development/Max/trunk/Frameworks/flac/build/Release -F/Users/krmathis/Development/Max/trunk/Frameworks/taglib/build/Release -F/Users/krmathis/Development/Max/trunk/Frameworks/mac/build/Release -F/Users/krmathis/Development/Max/trunk/Frameworks/sndfile/build/Release -F/Users/krmathis/Development/Max/trunk/Frameworks/mpcdec/build/Release -F/Users/krmathis/Development/Max/trunk/Frameworks/cuetools/build/Release -F/Users/krmathis/Development/Max/trunk/Frameworks/cdparanoia/build/Release -F/Users/krmathis/Development/Max/trunk/Frameworks/mp4v2/build/Release -F/Users/krmathis/Development/Max/trunk/Frameworks/cddb/build/Release -filelist /Users/krmathis/Development/Max/trunk/build/Max.build/Release/Max.build/Objects-normal/ppc/Max.LinkFileList -framework Cocoa -framework DiskArbitration -framework IOKit -framework CoreAudio -framework AudioToolbox -framework Carbon -framework AppKit -framework Security -framework Sparkle -framework Growl -framework ogg -framework vorbis -framework lame -framework wavpack -framework speex -framework FLAC -framework OggFLAC -framework taglib -framework mac -framework sndfile -framework mpcdec -framework cuetools -framework cdparanoia -framework mp4v2 -framework cddb -framework taglib -arch ppc -Wl,-Y,1455 -mmacosx-version-min=10.4 -isysroot /Developer/SDKs/MacOSX10.4u.sdk
/usr/bin/ld: Undefined symbols:
CAPETag::CAPETag(wchar_t const*, signed char)
CAPETag::SetFieldString(wchar_t const*, char const*, signed char)
CAPETag::Save(signed char)
/Users/krmathis/Development/Max/trunk/build/Max.build/Release/Max.build/Objects-normal/ppc/AudioMetadata.o reference to undefined CAPETag::CAPETag(wchar_t const*, signed char)
/Users/krmathis/Development/Max/trunk/build/Max.build/Release/Max.build/Objects-normal/ppc/MonkeysAudioEncoderTask.o reference to undefined CAPETag::SetFieldString(wchar_t const*, char const*, signed char)
/Users/krmathis/Development/Max/trunk/build/Max.build/Release/Max.build/Objects-normal/ppc/MonkeysAudioEncoderTask.o reference to undefined CAPETag::Save(signed char)
/Users/krmathis/Development/Max/trunk/build/Max.build/Release/Max.build/Objects-normal/ppc/MonkeysAudioEncoderTask.o reference to undefined CAPETag::CAPETag(wchar_t const*, signed char)
collect2: ld returned 1 exit status
** BUILD FAILED **

User avatar
sbooth
Site Admin
Posts: 2450
Joined: Fri Dec 23, 2005 7:45 am
Location: USA
Contact:

Post by sbooth » Wed Sep 27, 2006 3:23 pm

Maurits wrote:Is LAME 3.97 final in the frameworks now?
It's the version checked in to svn, yes.

User avatar
sbooth
Site Admin
Posts: 2450
Joined: Fri Dec 23, 2005 7:45 am
Location: USA
Contact:

Post by sbooth » Wed Sep 27, 2006 3:55 pm

krmathis wrote:
sbooth wrote:OK, I forgot to check in config_osx.h- it's there now.
Revision 940 compiled a lot further, but not until the end! ;)
I can duplicate the link errors, but cannot explain them:

Code: Select all

nm build/Release/mac.framework/mac | c++filt | grep CAPETag::CAPETag
0000a87c T CAPETag::CAPETag(CIO*, int)
0000a984 T CAPETag::CAPETag(wchar_t const*, int)
0000a900 T CAPETag::CAPETag(CIO*, int)
0000aa58 T CAPETag::CAPETag(wchar_t const*, int)
So the member functions in question appear twice in the text segment, once for PPC and once for Intel. So I'm a bit stumped as to why the link is failing.

User avatar
krmathis
Posts: 233
Joined: Thu Feb 02, 2006 11:05 am
Location: Oslo, Norway

Post by krmathis » Wed Sep 27, 2006 4:39 pm

sbooth wrote:I can duplicate the link errors, but cannot explain them:
My coding skills are very limited, so I can't help you any further.
But I have faith in you fixing it, or finding a way around it.

User avatar
sbooth
Site Admin
Posts: 2450
Joined: Fri Dec 23, 2005 7:45 am
Location: USA
Contact:

Post by sbooth » Thu Sep 28, 2006 2:10 am

Turns out I was just an idiot- in NoWindows.h BOOL was typedef'd to int, whereas in Objective C a BOOL is a signed char. I matched the typedefs and now everything is kosher.

If I paid closer attention to the prototypes, I would've noticed :)

User avatar
krmathis
Posts: 233
Joined: Thu Feb 02, 2006 11:05 am
Location: Oslo, Norway

Post by krmathis » Thu Sep 28, 2006 2:59 pm

Revision 948 compiled successfully, and have been uploaded to the usual place! :wink:

User avatar
krmathis
Posts: 233
Joined: Thu Feb 02, 2006 11:05 am
Location: Oslo, Norway

Post by krmathis » Fri Sep 29, 2006 7:21 pm

I am used to build failures these days! ;)

Here are the revision 954 one...
/usr/bin/gcc-4.0 -x objective-c -arch ppc -pipe -Wno-trigraphs -fobjc-exceptions -fpascal-strings -fasm-blocks -g -Os -Wmissing-prototypes -Wreturn-type -Wmissing-braces -Wparentheses -Wswitch -Wunused-function -Wunused-label -Wunused-parameter -Wunused-variable -Wunused-value -Wshadow -Wsign-compare -Wnewline-eof -D__MACOSX__ -fmessage-length=0 -mtune=G5 -fvisibility=hidden -mmacosx-version-min=10.4 -I/Users/krmathis/Development/Max/trunk/build/Max.build/Release/Max.build/Max.hmap -mdynamic-no-pic -F/Users/krmathis/Development/Max/trunk/build/Release -F/Users/krmathis/Development/Max/trunk -F/Users/krmathis/Development/Max/trunk/Frameworks -F/Users/krmathis/Development/Max/trunk/Frameworks/Sparkle/build/Release -F/Users/krmathis/Development/Max/trunk/Frameworks/Growl/build/Deployment -F/Users/krmathis/Development/Max/trunk/Frameworks/ogg/build/Release -F/Users/krmathis/Development/Max/trunk/Frameworks/vorbis/build/Release -F/Users/krmathis/Development/Max/trunk/Frameworks/lame/build/Release -F/Users/krmathis/Development/Max/trunk/Frameworks/wavpack/build/Release -F/Users/krmathis/Development/Max/trunk/Frameworks/speex/build/Release -F/Users/krmathis/Development/Max/trunk/Frameworks/flac/build/Release -F/Users/krmathis/Development/Max/trunk/Frameworks/taglib/build/Release -F/Users/krmathis/Development/Max/trunk/Frameworks/mac/build/Release -F/Users/krmathis/Development/Max/trunk/Frameworks/sndfile/build/Release -F/Users/krmathis/Development/Max/trunk/Frameworks/mpcdec/build/Release -F/Users/krmathis/Development/Max/trunk/Frameworks/cuetools/build/Release -F/Users/krmathis/Development/Max/trunk/Frameworks/cdparanoia/build/Release -F/Users/krmathis/Development/Max/trunk/Frameworks/mp4v2/build/Release -F/Users/krmathis/Development/Max/trunk/Frameworks/cddb/build/Release -I/Users/krmathis/Development/Max/trunk/build/Release/include -I/Users/krmathis/Development/Max/trunk/Frameworks/shorten/build/Release/shorten.framework/Headers -I/Users/krmathis/Development/Max/trunk/Frameworks/taglib/build/Release/taglib.framework/Headers -I/Users/krmathis/Development/Max/trunk/Frameworks/mp4v2/build/Release/mp4v2.framework/Headers -I/Users/krmathis/Development/Max/trunk/Frameworks/flac/build/Release/FLAC.framework/Headers -I/Users/krmathis/Development/Max/trunk/Frameworks/flac/build/Release/OggFLAC.framework/Headers -I/Users/krmathis/Development/Max/trunk/build/Max.build/Release/Max.build/DerivedSources -isysroot /Developer/SDKs/MacOSX10.4u.sdk -c /Users/krmathis/Development/Max/trunk/Decoders/Decoder.m -o /Users/krmathis/Development/Max/trunk/build/Max.build/Release/Max.build/Objects-normal/ppc/Decoder.o
In file included from /Users/krmathis/Development/Max/trunk/Utilities/UtilityFunctions.h:23,
from /Users/krmathis/Development/Max/trunk/Decoders/Decoder.m:22:
/Users/krmathis/Development/Max/trunk/Frameworks/flac/build/Release/FLAC.framework/Headers/metadata.h:1690: warning: declaration of 'index' shadows a global declaration
/Developer/SDKs/MacOSX10.4u.sdk/usr/include/string.h:122: warning: shadowed declaration is here
In file included from /Users/krmathis/Development/Max/trunk/Frameworks/flac/build/Release/FLAC.framework/Headers/seekable_stream_decoder.h:36,
from /Users/krmathis/Development/Max/trunk/Frameworks/flac/build/Release/FLAC.framework/Headers/file_decoder.h:36,
from /Users/krmathis/Development/Max/trunk/Decoders/FLACDecoder.h:24,
from /Users/krmathis/Development/Max/trunk/Decoders/Decoder.m:25:
/Users/krmathis/Development/Max/trunk/Frameworks/flac/build/Release/FLAC.framework/Headers/stream_decoder.h:545: warning: declaration of 'id' shadows a global declaration
/Developer/SDKs/MacOSX10.4u.sdk/usr/include/objc/objc.h:43: warning: shadowed declaration is here
/Users/krmathis/Development/Max/trunk/Frameworks/flac/build/Release/FLAC.framework/Headers/stream_decoder.h:586: warning: declaration of 'id' shadows a global declaration
/Developer/SDKs/MacOSX10.4u.sdk/usr/include/objc/objc.h:43: warning: shadowed declaration is here
In file included from /Users/krmathis/Development/Max/trunk/Frameworks/flac/build/Release/FLAC.framework/Headers/file_decoder.h:36,
from /Users/krmathis/Development/Max/trunk/Decoders/FLACDecoder.h:24,
from /Users/krmathis/Development/Max/trunk/Decoders/Decoder.m:25:
/Users/krmathis/Development/Max/trunk/Frameworks/flac/build/Release/FLAC.framework/Headers/seekable_stream_decoder.h:619: warning: declaration of 'id' shadows a global declaration
/Developer/SDKs/MacOSX10.4u.sdk/usr/include/objc/objc.h:43: warning: shadowed declaration is here
/Users/krmathis/Development/Max/trunk/Frameworks/flac/build/Release/FLAC.framework/Headers/seekable_stream_decoder.h:662: warning: declaration of 'id' shadows a global declaration
/Developer/SDKs/MacOSX10.4u.sdk/usr/include/objc/objc.h:43: warning: shadowed declaration is here
In file included from /Users/krmathis/Development/Max/trunk/Decoders/FLACDecoder.h:24,
from /Users/krmathis/Development/Max/trunk/Decoders/Decoder.m:25:
/Users/krmathis/Development/Max/trunk/Frameworks/flac/build/Release/FLAC.framework/Headers/file_decoder.h:373: warning: declaration of 'id' shadows a global declaration
/Developer/SDKs/MacOSX10.4u.sdk/usr/include/objc/objc.h:43: warning: shadowed declaration is here
/Users/krmathis/Development/Max/trunk/Frameworks/flac/build/Release/FLAC.framework/Headers/file_decoder.h:416: warning: declaration of 'id' shadows a global declaration
/Developer/SDKs/MacOSX10.4u.sdk/usr/include/objc/objc.h:43: warning: shadowed declaration is here
In file included from /Users/krmathis/Development/Max/trunk/Frameworks/flac/build/Release/OggFLAC.framework/Headers/seekable_stream_decoder.h:36,
from /Users/krmathis/Development/Max/trunk/Frameworks/flac/build/Release/OggFLAC.framework/Headers/file_decoder.h:37,
from /Users/krmathis/Development/Max/trunk/Decoders/OggFLACDecoder.h:24,
from /Users/krmathis/Development/Max/trunk/Decoders/Decoder.m:29:
/Users/krmathis/Development/Max/trunk/Frameworks/flac/build/Release/OggFLAC.framework/Headers/stream_decoder.h:366: warning: declaration of 'id' shadows a global declaration
/Developer/SDKs/MacOSX10.4u.sdk/usr/include/objc/objc.h:43: warning: shadowed declaration is here
/Users/krmathis/Development/Max/trunk/Frameworks/flac/build/Release/OggFLAC.framework/Headers/stream_decoder.h:410: warning: declaration of 'id' shadows a global declaration
/Developer/SDKs/MacOSX10.4u.sdk/usr/include/objc/objc.h:43: warning: shadowed declaration is here
In file included from /Users/krmathis/Development/Max/trunk/Frameworks/flac/build/Release/OggFLAC.framework/Headers/file_decoder.h:37,
from /Users/krmathis/Development/Max/trunk/Decoders/OggFLACDecoder.h:24,
from /Users/krmathis/Development/Max/trunk/Decoders/Decoder.m:29:
/Users/krmathis/Development/Max/trunk/Frameworks/flac/build/Release/OggFLAC.framework/Headers/seekable_stream_decoder.h:569: warning: declaration of 'id' shadows a global declaration
/Developer/SDKs/MacOSX10.4u.sdk/usr/include/objc/objc.h:43: warning: shadowed declaration is here
/Users/krmathis/Development/Max/trunk/Frameworks/flac/build/Release/OggFLAC.framework/Headers/seekable_stream_decoder.h:612: warning: declaration of 'id' shadows a global declaration
/Developer/SDKs/MacOSX10.4u.sdk/usr/include/objc/objc.h:43: warning: shadowed declaration is here
In file included from /Users/krmathis/Development/Max/trunk/Decoders/OggFLACDecoder.h:24,
from /Users/krmathis/Development/Max/trunk/Decoders/Decoder.m:29:
/Users/krmathis/Development/Max/trunk/Frameworks/flac/build/Release/OggFLAC.framework/Headers/file_decoder.h:344: warning: declaration of 'id' shadows a global declaration
/Developer/SDKs/MacOSX10.4u.sdk/usr/include/objc/objc.h:43: warning: shadowed declaration is here
/Users/krmathis/Development/Max/trunk/Frameworks/flac/build/Release/OggFLAC.framework/Headers/file_decoder.h:387: warning: declaration of 'id' shadows a global declaration
/Developer/SDKs/MacOSX10.4u.sdk/usr/include/objc/objc.h:43: warning: shadowed declaration is here
In file included from /Users/krmathis/Development/Max/trunk/Decoders/WavPackDecoder.h:24,
from /Users/krmathis/Development/Max/trunk/Decoders/Decoder.m:32:
/Users/krmathis/Development/Max/trunk/Frameworks/wavpack/build/Release/wavpack.framework/Headers/wputils.h:76: warning: declaration of 'id' shadows a global declaration
/Developer/SDKs/MacOSX10.4u.sdk/usr/include/objc/objc.h:43: warning: shadowed declaration is here
/Users/krmathis/Development/Max/trunk/Frameworks/wavpack/build/Release/wavpack.framework/Headers/wputils.h:77: warning: declaration of 'id' shadows a global declaration
/Developer/SDKs/MacOSX10.4u.sdk/usr/include/objc/objc.h:43: warning: shadowed declaration is here
/Users/krmathis/Development/Max/trunk/Frameworks/wavpack/build/Release/wavpack.framework/Headers/wputils.h:78: warning: declaration of 'id' shadows a global declaration
/Developer/SDKs/MacOSX10.4u.sdk/usr/include/objc/objc.h:43: warning: shadowed declaration is here
/Users/krmathis/Development/Max/trunk/Frameworks/wavpack/build/Release/wavpack.framework/Headers/wputils.h:79: warning: declaration of 'id' shadows a global declaration
/Developer/SDKs/MacOSX10.4u.sdk/usr/include/objc/objc.h:43: warning: shadowed declaration is here
/Users/krmathis/Development/Max/trunk/Frameworks/wavpack/build/Release/wavpack.framework/Headers/wputils.h:80: warning: declaration of 'id' shadows a global declaration
/Developer/SDKs/MacOSX10.4u.sdk/usr/include/objc/objc.h:43: warning: shadowed declaration is here
/Users/krmathis/Development/Max/trunk/Frameworks/wavpack/build/Release/wavpack.framework/Headers/wputils.h:81: warning: declaration of 'id' shadows a global declaration
/Developer/SDKs/MacOSX10.4u.sdk/usr/include/objc/objc.h:43: warning: shadowed declaration is here
/Users/krmathis/Development/Max/trunk/Frameworks/wavpack/build/Release/wavpack.framework/Headers/wputils.h:82: warning: declaration of 'id' shadows a global declaration
/Developer/SDKs/MacOSX10.4u.sdk/usr/include/objc/objc.h:43: warning: shadowed declaration is here
/Users/krmathis/Development/Max/trunk/Frameworks/wavpack/build/Release/wavpack.framework/Headers/wputils.h:85: warning: declaration of 'id' shadows a global declaration
/Developer/SDKs/MacOSX10.4u.sdk/usr/include/objc/objc.h:43: warning: shadowed declaration is here
/Users/krmathis/Development/Max/trunk/Frameworks/wavpack/build/Release/wavpack.framework/Headers/wputils.h:88: warning: declaration of 'id' shadows a global declaration
/Developer/SDKs/MacOSX10.4u.sdk/usr/include/objc/objc.h:43: warning: shadowed declaration is here
/Users/krmathis/Development/Max/trunk/Frameworks/wavpack/build/Release/wavpack.framework/Headers/wputils.h:148: warning: declaration of 'index' shadows a global declaration
/Developer/SDKs/MacOSX10.4u.sdk/usr/include/string.h:122: warning: shadowed declaration is here
In file included from /Users/krmathis/Development/Max/trunk/Decoders/Decoder.m:33:
/Users/krmathis/Development/Max/trunk/Decoders/ShortenDecoder.h:25:28: error: shorten/decode.h: No such file or directory
In file included from /Users/krmathis/Development/Max/trunk/Decoders/Decoder.m:33:
/Users/krmathis/Development/Max/trunk/Decoders/ShortenDecoder.h:29: error: parse error before 'shn_file'
/Users/krmathis/Development/Max/trunk/Decoders/Decoder.m: In function '-[Decoder seekToFrame:]':
/Users/krmathis/Development/Max/trunk/Decoders/Decoder.m:178: warning: unused parameter 'frame'
** BUILD FAILED **

User avatar
sbooth
Site Admin
Posts: 2450
Joined: Fri Dec 23, 2005 7:45 am
Location: USA
Contact:

Post by sbooth » Fri Sep 29, 2006 8:26 pm

krmathis wrote:I am used to build failures these days! ;)

Here are the revision 954 one...
This is probably a dumb question, but did you run the build-frameworks.sh script?

User avatar
krmathis
Posts: 233
Joined: Thu Feb 02, 2006 11:05 am
Location: Oslo, Norway

Post by krmathis » Fri Sep 29, 2006 10:23 pm

sbooth wrote:
krmathis wrote:I am used to build failures these days! ;)

Here are the revision 954 one...
This is probably a dumb question, but did you run the build-frameworks.sh script?
Yes I did, as it is a part of my build script.
It seems like it compiled the Shorten framework as well:
=== BUILDING NATIVE TARGET shorten.framework WITH CONFIGURATION Release ===

Checking Dependencies...
** BUILD SUCCEEDED **

Post Reply