Resolved: Build error -> Revision 251

Discuss the development and future direction of Play.
Post Reply
User avatar
krmathis
Posts: 233
Joined: Thu Feb 02, 2006 11:05 am
Location: Oslo, Norway

Resolved: Build error -> Revision 251

Post by krmathis » Sat Jan 27, 2007 7:42 am

I get the following error building revision 251:
/usr/bin/gcc-4.0 -x objective-c -arch ppc -pipe -Wno-trigraphs -fobjc-exceptions -fpascal-strings -fasm-blocks -Os -Wreturn-type -Wunused-variable -fmessage-length=0 -mtune=G5 -fvisibility=hidden -mmacosx-version-min=10.4 -I/Users/****/Development/Play/trunk/build/Play.build/Release/Play.build/Play.hmap -mdynamic-no-pic -F/Users/****/Development/Play/trunk/build/Release -F/Users/****/Development/Play/trunk/Frameworks -F/Users/****/Development/Play/trunk/Frameworks -F/Users/****/Development/Play/trunk/Frameworks -F/Users/****/Development/Play/trunk/Frameworks -F/Users/****/Development/Play/trunk/Frameworks -I/Users/****/Development/Play/trunk/build/Release/include -I/Users/****/Development/Play/trunk/Frameworks/taglib.framework/Headers -I/Users/****/Development/Play/trunk/Frameworks/mp4v2.framework/Headers -I/Users/****/Development/Play/trunk/build/Play.build/Release/Play.build/DerivedSources -isysroot /Developer/SDKs/MacOSX10.4u.sdk -include /Library/Caches/com.apple.Xcode.501/SharedPrecompiledHeaders/Play_Prefix-bshifccuknxrvvfvrkmomcumpwzr/Play_Prefix.pch -D__MACOSX__ -c /Users/****/Development/Play/trunk/LibraryDocument/LibraryDocument.m -o /Users/****/Development/Play/trunk/build/Play.build/Release/Play.build/Objects-normal/ppc/LibraryDocument-4D7CDA64.o
/Users/****/Development/Play/trunk/LibraryDocument/LibraryDocument.m:67:18: error: Timer.h: No such file or directory
/Users/****/Development/Play/trunk/LibraryDocument/LibraryDocument.m: In function '-[LibraryDocument(Private) scheduleURLForAddition:]':
/Users/****/Development/Play/trunk/LibraryDocument/LibraryDocument.m:1940: error: 'Timer' undeclared (first use in this function)
/Users/****/Development/Play/trunk/LibraryDocument/LibraryDocument.m:1940: error: (Each undeclared identifier is reported only once
/Users/****/Development/Play/trunk/LibraryDocument/LibraryDocument.m:1940: error: for each function it appears in.)
/Users/****/Development/Play/trunk/LibraryDocument/LibraryDocument.m:1940: error: 'timer' undeclared (first use in this function)
/Users/****/Development/Play/trunk/LibraryDocument/LibraryDocument.m: In function '-[LibraryDocument(Private) insertEntityForURL:]':
/Users/****/Development/Play/trunk/LibraryDocument/LibraryDocument.m:2007: error: 'Timer' undeclared (first use in this function)
/Users/****/Development/Play/trunk/LibraryDocument/LibraryDocument.m:2007: error: 'timer' undeclared (first use in this function)
** BUILD FAILED **
Seems like you forgot to check in the Timer.h file... :wink:
Last edited by krmathis on Sat Jan 27, 2007 8:04 pm, edited 1 time in total.

User avatar
sbooth
Site Admin
Posts: 2445
Joined: Fri Dec 23, 2005 7:45 am
Location: USA
Contact:

Re: Build error -> Revision 251

Post by sbooth » Sat Jan 27, 2007 5:05 pm

krmathis wrote:Seems like you forgot to check in the Timer.h file... :wink:
Actually I accidentally checked in code that referenced it! It was just one of my explorations of why Play is slow to add files. It should be fixed now.

User avatar
krmathis
Posts: 233
Joined: Thu Feb 02, 2006 11:05 am
Location: Oslo, Norway

Post by krmathis » Sat Jan 27, 2007 6:59 pm

Well, I got a different error on revision 252:
/usr/bin/gcc-4.0 -x objective-c -arch ppc -pipe -Wno-trigraphs -fobjc-exceptions -fpascal-strings -fasm-blocks -Os -Wreturn-type -Wunused-variable -fmessage-length=0 -mtune=G5 -fvisibility=hidden -mmacosx-version-min=10.4 -I/Users/****/Development/Play/trunk/build/Play.build/Release/Play.build/Play.hmap -mdynamic-no-pic -F/Users/****/Development/Play/trunk/build/Release -F/Users/****/Development/Play/trunk/Frameworks -F/Users/****/Development/Play/trunk/Frameworks -F/Users/****/Development/Play/trunk/Frameworks -F/Users/****/Development/Play/trunk/Frameworks -F/Users/****/Development/Play/trunk/Frameworks -I/Users/****/Development/Play/trunk/build/Release/include -I/Users/****/Development/Play/trunk/Frameworks/taglib.framework/Headers -I/Users/****/Development/Play/trunk/Frameworks/mp4v2.framework/Headers -I/Users/****/Development/Play/trunk/build/Play.build/Release/Play.build/DerivedSources -isysroot /Developer/SDKs/MacOSX10.4u.sdk -include /Library/Caches/com.apple.Xcode.501/SharedPrecompiledHeaders/Play_Prefix-bshifccuknxrvvfvrkmomcumpwzr/Play_Prefix.pch -D__MACOSX__ -c /Users/****/Development/Play/trunk/Audio/Decoders/AudioStreamDecoder.m -o /Users/****/Development/Play/trunk/build/Play.build/Release/Play.build/Objects-normal/ppc/AudioStreamDecoder.o
In file included from /Users/****/Development/Play/trunk/Audio/Decoders/WavPackStreamDecoder.h:22,
from /Users/****/Development/Play/trunk/Audio/Decoders/AudioStreamDecoder.m:45:
/Users/****/Development/Play/trunk/Frameworks/wavpack.framework/Headers/wavpack.h:114: error: conflicting types for 'ChunkHeader'
/Developer/SDKs/MacOSX10.4u.sdk/System/Library/Frameworks/CoreServices.framework/Frameworks/CarbonCore.framework/Headers/AIFF.h:84: error: previous declaration of 'ChunkHeader' was here
** BUILD FAILED **
This is using a fresh 252 source and the 20061112 frameworks.

User avatar
sbooth
Site Admin
Posts: 2445
Joined: Fri Dec 23, 2005 7:45 am
Location: USA
Contact:

Post by sbooth » Sat Jan 27, 2007 7:15 pm

I've posted a new Frameworks archive. I forgot I'd updated those!

User avatar
krmathis
Posts: 233
Joined: Thu Feb 02, 2006 11:05 am
Location: Oslo, Norway

Post by krmathis » Sat Jan 27, 2007 8:03 pm

Revision 252 built successfully using the 20070126 frameworks.
Thanks! :D

Post Reply

Who is online

Users browsing this forum: Baidu [Spider] and 2 guests